Timor-Leste
type: Concept
alternative label: Democratic Republic of Timor-Leste
alternative label: جمهوری دموکراتیک تیمور-لسته @fa
broader: South East Asia
preferred label: تیمور-لسته @fa
scope note: قسمتی از اندونزی قبل از می 2002؛ برای اطلاعات مربوط به آن منطقه قبل از تغییر وضعیت به کار برید تیمور شرقی @fa
scope note: Part of Indonesia before May 2002; for data dealing with that region before the change of status use <4436>

South East Asia
type: Concept
has narrower match: Timor-Leste
narrower: Timor-Leste
preferred label: جنوب شرق آسیا @fa