دارای هدف فعالیت
label: has object of activity @en

دارای اصطلاح وابسته
label: has related @en

شناسه گر
label: identifier @en

نظام‌های کشت‌ومرتع
type: Concept
دارای هدف فعالیت: گله‌داری
دارای اصطلاح وابسته: جنگل زراعی
دارای اصطلاح وابسته: گله‌داری
شناسه گر: جنگل زراعی
broader: جنگل زراعی
preferred label: Agrosilvopastoral systems @en
scope note: Agroforestry systems with woody perennials, food crops, pastures and livestock @en
scope note: سیستم‌های جنگل زراعی همراه با درختان چندساله، محصولات غذایی، چراگاه‌ها و دام.

جنگل زراعی
type: Concept
دارای اصطلاح وابسته: نظام‌های کشت‌ومرتع
is in semantic relation with: نظام‌های کشت‌ومرتع
narrower: نظام‌های کشت‌ومرتع
preferred label: Agroforestry @en

گله‌داری
type: Concept
دارای اصطلاح وابسته: نظام‌های کشت‌ومرتع
is natural enemy of: نظام‌های کشت‌ومرتع
preferred label: Pastoralism @en