Transitional farming
type: Concept
broader: Farming systems
preferred label: زراعت گذرا @fa
scope note: Transition between subsistence and commercial systems
scope note: گذر بین نظام‌های معیشتی و تجاری. @fa

Farming systems
type: Concept
has narrower: Transitional farming
narrower: Transitional farming
preferred label: نظام‌های مزرعه‌داری @fa