Non food industries
type: Concept
broader: Industry
preferred label: صنایع غیر غذایی @fa
scope note: Using agricultural raw materials for producing non food products
scope note: استفاده از مواد خام کشاورزی برای تولید محصولات غیر خوراکی. @fa

Industry
type: Concept
narrower: Non food industries
preferred label: صنعت @fa