Agricultural economics
type: Concept
alternative label: Rural economics
alternative label: اقتصاد روستایی @fa
broader: Economics
preferred label: علم اقتصاد کشاورزی @fa
scope note: برای اقتصاد کشاورزی به کار برید بخش کشاورزی @fa
scope note: For the agricultural economy use <2801>

Economics
type: Concept
has narrower: Agricultural economics
narrower: Agricultural economics
preferred label: علم اقتصاد @fa