Glyceraldehyde 3 phosphate dehydrog
type: Concept
broader: Oxidoreductases
preferred label: گلیسرآلدئید 3 فسفات دهیدروژناز @fa
scope note: Glyceraldehyde 3 phosphate dehydrogenase; IUPAC code 1 2 1 12
scope note: گلیسرآلدئید 3 فسفات دهیدروژناز @fa

Oxidoreductases
type: Concept
narrower: Glyceraldehyde 3 phosphate dehydrog
preferred label: اکسیدوردوکتازها @fa