Wintering
type: Concept
alternative label: Livestock overwintering
alternative label: دامپروری طی زمستان @fa
broader: Animal husbandry methods
preferred label: دامپروری زمستانه @fa
scope note: Care, feeding and maintenance of livestock through the winter months
scope note: مواظبت، غذادادن و نگهداری دام در ماه‌های زمستان. @fa

Animal husbandry methods
type: Concept
narrower: Wintering
preferred label: روش‌های دامپروری @fa