Diaphragm
type: Concept
broader: Muscles
preferred label: دیافراگم @fa
scope note: Muscular partition separating thorax from abdomen in mammals
scope note: دیواره عضلانی جداکننده قفسه سینه از شکم در پستانداران. @fa

Muscles
type: Concept
has narrower: Diaphragm
narrower: Diaphragm
preferred label: عضلات @fa