Outdoor cropping
type: Concept
broader: Cultural methods
preferred label: زراعت در محیط باز @fa
scope note: مربوط به محصولات باغی در برابرزراعت حفاظت‌شده @fa
scope note: Of horticultural crops, as opposed to <6243>

Cultural methods
type: Concept
has narrower: Outdoor cropping
narrower: Outdoor cropping
preferred label: روش‌های کشت @fa