دارای مفهوم (واژه) اعم
label: has broader @en

دارای اصطلاح اخص
label: has narrower @en

رابطه والد فرزندی
label: parents @en

جایگزین‌های شیر
type: Concept
دارای مفهوم (واژه) اعم: غذاهای شبیه‌سازی‌شده
دارای اصطلاح اخص: شیر نارگیل
رابطه والد فرزندی: غذاهای شبیه‌سازی‌شده
alternative label: Coffee whiteners @en
alternative label: سفیدکننده‌های قهوه
broader: غذاهای شبیه‌سازی‌شده
preferred label: Milk substitutes @en
scope note: جایگزین‌های شیر برای تغذیه انسان؛ برای جایگزین‌های شیر تغذیه کننده گوساله‌ها و جانوران کم‌سن دیگر به کار برید جایگزین‌های شیر (جانوران)
scope note: Milk substitutes in human feeding; for milk substitutes fed to calves or other young animals use <16192> @en

غذاهای شبیه‌سازی‌شده
type: Concept
دارای اصطلاح اخص: جایگزین‌های شیر
narrower: جایگزین‌های شیر
preferred label: Simulated foods @en

شیر نارگیل
type: Concept
preferred label: Coconut milk @en