دارای اصطلاح وابسته
label: has related @en

آناریکاس
type: Concept
دارای اصطلاح وابسته: گربه‌ماهی دریایی (آب‌های شمالی)
preferred label: Anarhichas @en

گربه‌ماهی دریایی (آب‌های شمالی)
type: Concept
دارای اصطلاح وابسته: آناریکاس
alternative label: گرگ‌ماهی
alternative label: Wolffish @en
broader: ماهیان آب شور
preferred label: Marine catfish @en
scope note: برای گربه‌ماهی آب‌های گرم به کار برید گربه‌ماهی دریایی (آب‌های گرم)
scope note: For catfish from warm seas use <6895> @en

ماهیان آب شور
type: Concept
narrower: گربه‌ماهی دریایی (آب‌های شمالی)
preferred label: Saltwater fishes @en