دارای اصطلاح وابسته
label: has related @en

ساردینا
type: Concept
دارای اصطلاح وابسته: ماهیان ساردین
preferred label: Sardina @en

ساردینوپس
type: Concept
دارای اصطلاح وابسته: ماهیان ساردین
preferred label: Sardinops @en

ماهیان ساردین
type: Concept
دارای اصطلاح وابسته: ساردینوپس
دارای اصطلاح وابسته: ساردینا
broader: ماهیان آب شور
preferred label: Sardines @en
scope note: Isscaap group b-35; note that this term may also be applied in the fish trade to sprats and small herrings @en
scope note: ایساکاپ گروه b-35، توجه کنید که این اصطلاح ممکن است در تجارت ماهی برای شاه‌ماهیان نیز به کار برده شود.

ماهیان آب شور
type: Concept
narrower: ماهیان ساردین
preferred label: Saltwater fishes @en