دارای اصطلاح وابسته
label: has related @en

درون‌داد برای
label: is input for @en

الیاف گیاهی
type: Concept
دارای اصطلاح وابسته: منسوجات طبیعی
is used in: منسوجات طبیعی
preferred label: Plant fibres @en

منسوجات طبیعی
type: Concept
دارای اصطلاح وابسته: الیاف گیاهی
درون‌داد برای: الیاف گیاهی
broader: منسوجات
preferred label: Natural fabrics @en
scope note: Plant tissues extracted in layers or sheets and used as substitutes for textiles @en
scope note: بافت گیاهی که از لایه‌ها یا برگ‌ها گرفته شده و به عنوان جایگزین منسوجات به کار رود.

منسوجات
type: Concept
narrower: منسوجات طبیعی
preferred label: Textiles @en