Lithuanian SSR
type: Concept
broader: USSR
preferred label: لیتوانی (جمهوری سوسیالیست شوروی) @fa
scope note: قسمتی از اتحاد جماهیر شوروی تا سال 1991؛ برای استفاده از مدارک مربوط به آن منطقه قبل از تغییر وضعیت؛ برای بعد از آن به کار برید لیتوانی @fa
scope note: Part of USSR till 1991; to be used for documents dealing with that region before the change of status; later use <12204>

USSR
type: Concept
has narrower: Lithuanian SSR
narrower: Lithuanian SSR
preferred label: اتحاد جماهیر سوسیالیست شوروی (یو.اس.اس.آر) @fa