Agroindustrial complexes
type: Concept
broader: Enterprises
preferred label: مجتمع‌های کشت و صنعت @fa
scope note: Integration of agricultural production, processing and marketing under a single comprehensive management
scope note: تلفیق تولید، فراهم‌آوری، و بازاریابی کشاورزی تحت مدیریت واحد و جامع. @fa

Enterprises
type: Concept
narrower: Agroindustrial complexes
preferred label: بنگاه‌های اقتصادی @fa