Autecology
type: Concept
broader: Ecology
preferred label: تک‌بوم‌شناسی @fa
scope note: بوم‌شناسی موجودات زنده یا گونه‌ها به صورت انفرادی و مجزا، برای یافتن متضاد آن رجوع کنید به همبوم‌شناسی @fa
scope note: Ecology of individual organisms or species as opposed to <7571>

Ecology
type: Concept
has narrower: Autecology
narrower: Autecology
preferred label: بوم‌شناسی @fa