Bioassays
type: Concept
alternative label: Biotests
alternative label: زیست‌آزمون‌ها @fa
broader: Biological analysis
preferred label: زیست‌سنجش‌ها @fa
scope note: Determination of the concentration of a substance by its effect on a living organism
scope note: تعیین غلظت یک ماده توسط تاثیر آن بر موجود زنده @fa

Biological analysis
type: Concept
narrower: Bioassays
preferred label: تجزیه و تحلیل زیستی @fa