Slovak Republic
type: Concept
alternative label: Slovakia
alternative label: اسلواکی @fa
broader: Eastern Europe
preferred label: جمهوری اسلواکی @fa
scope note: Part of CSFR till 31.12.1992
scope note: قسمتی از جمهوری فدرال چکسلواکی تا 1992/12/31 @fa

Eastern Europe
type: Concept
narrower: Slovak Republic
preferred label: اروپای شرقی @fa