Latvia
type: Concept
broader: Baltic states
preferred label: لتونی @fa
scope note: قسمتی از اتحاد جماهیر شوروی قبل از سال 1992؛ برای مدارک مربوط به آن منطقه قبل از تغییر وضعیت به کار برید لتونی (جمهوری سوسیالیست شوروی) @fa
scope note: Part of USSR before 1992; for documents dealing with that region before the change of status use <4224>

Baltic states
type: Concept
narrower: Latvia
preferred label: کشورهای بالتیک @fa