Former Yugoslav Republic of Macedonia
type: Concept
broader: Balkans
preferred label: جمهوری یوگسلاو مقدونیه @fa
scope note: The Former Yugoslav Republic of Macedonia
scope note: جمهوری یوگسلاو مقدونیه. @fa

Balkans
type: Concept
narrower: Former Yugoslav Republic of Macedonia
preferred label: کشورهای بالکان @fa