Scald
type: Concept
broader: Plant diseases
preferred label: لکه‌سوختگی @fa
scope note: Browning of fruit peel resulting from high temperature and/or intense light
scope note: قهوه‌ای شدن پوست میوه در نتیجه دمای بالا یا نور شدید. @fa

Plant diseases
type: Concept
has narrower: Scald
narrower: Scald
preferred label: بیماری‌های گیاهی @fa