Sheds
type: Concept
broader: Buildings
preferred label: اتاقک‌ها @fa
scope note: ساختمان‌هایی برای محافظت از دستگاه‌ها؛ برای گله به کار برید گاودانی‌ها @fa
scope note: Buildings for shelter of machinery; for cattle use <1392>

Buildings
type: Concept
has narrower: Sheds
narrower: Sheds
preferred label: ساختمان‌ها @fa