ILCA
type: Concept
broader: International organizations
preferred label: مرکز بین‌المللی دام آفریقا (ایلکا) @fa
scope note: International Livestock Centre for Africa
scope note: مرکز بین‌المللی دام آفریقا @fa

International organizations
type: Concept
narrower: ILCA
preferred label: سازمان‌های بین‌المللی @fa