Tuber melanosporum
type: Concept
broader: Tuber (truffles)
preferred label: توبر ملانوسپوروم @fa

Tuber (truffles)
type: Concept
alternative label: Truffles
alternative label: قارچ‌های دنبلان @fa
broader: Pezizales
narrower: Tuber melanosporum
preferred label: توبر (قارچ‌های دنبلان) @fa
scope note: سرده قارچ؛ برای برجستگی گیاهی به کار برید تکمه‌ها (گیاه) @fa
scope note: Fungus genus; for plant tubers use <7998>

Pezizales
type: Concept
narrower: Tuber (truffles)
preferred label: پزیزالز @fa