دارای مفهوم (واژه) اعم
label: has broader @en

رابطه والد فرزندی
label: parents @en

بیشه‌ها
type: Concept
دارای مفهوم (واژه) اعم: پوشش گیاهی
رابطه والد فرزندی: پوشش گیاهی
broader: پوشش گیاهی
preferred label: Woodlands @en
scope note: نواحی دارای پوشش گیاهی چوبی تاج‌پوشه‌های کمتر از جنگل‌ها؛ همچنین ببینید خارستان‌ها
scope note: Areas of woody vegetation forming a less dense canopy than in forests; see also <6887> @en

پوشش گیاهی
type: Concept
has narrower: بیشه‌ها
narrower: بیشه‌ها
preferred label: Vegetation @en