Trampling
type: Concept
broader: Mechanical damage
preferred label: پایمالی (زیان مکانیکی) @fa
scope note: Damaging of plants by movements of animals or human beings
scope note: صدمه به گیاهان به دلیل حرکت حیوانات و انسان‌ها. @fa

Mechanical damage
type: Concept
has narrower: Trampling
narrower: Trampling
preferred label: خسارت مکانیکی @fa