North Yemen
alternative label: Yemen Arab Republic
alternative label: جمهوری عربی یمن @fa
scope note: To be used for documents published or dealing with the situation in the region before May 1990
scope note: برای استفاده از مدارک منتشرشده مربوط به شرایط ان منطقه قبل از می 1990 @fa
broader: Gulf states
preferred label: یمن شمالی @fa
type: Concept

Gulf states
preferred label: کشورهای حوزه خلیج فارس @fa
type: Concept
narrower: North Yemen