Cropping systems
preferred label: نظام‌های زراعی @fa
type: Concept
has narrower: Phased planting
narrower: Phased planting

Phased planting
scope note: Planting of a given crop distributed over several weeks
scope note: کاشت محصولی مشخص به صورت تقسیم شده در چند هفته. @fa
broader: Cropping systems
preferred label: کاشت مرحله‌بندی @fa
type: Concept