Primary conversion of wood
scope note: First stage of transformation of timber into any kind of product, including topping, trimming, barking, cross cutting and initial sawing up, hewing or cleaving of a felled tree
scope note: اولین مرحله تغییر شکل کنده از قبیل هرس کردن، تراشیدن، کندن پوست درخت، برش عرضی و اره کردن ابتدایی، قطع کردن، بریدن درخت انداخته شده. @fa
broader: Forestry operations
preferred label: واگردانی اولیه چوب @fa
type: Concept

Forestry operations
preferred label: عملیات جنگل‌داری @fa
type: Concept
has narrower: Primary conversion of wood
narrower: Primary conversion of wood