زراعت در محیط باز
scope note: مربوط به محصولات باغی در برابرزراعت حفاظت‌شده
scope note: Of horticultural crops, as opposed to <6243> @en
broader: روش‌های کشت
preferred label: Outdoor cropping @en
type: Concept

روش‌های کشت
preferred label: Cultural methods @en
type: Concept
has narrower: زراعت در محیط باز
narrower: زراعت در محیط باز