سالمندی
scope note: پیرشدن موجودات زنده; برای محصولات به کار برید رسیدگی (گیاه)
scope note: Growing old of organisms; for products use <13933> @en
broader: تکوین زیستی
preferred label: Aging @en
type: Concept

تکوین زیستی
preferred label: Biological development @en
type: Concept
narrower: سالمندی