High yielding varieties
alternative label: Green revolution
alternative label: انقلاب سبز @fa
scope note: Restricted to plants; for animals use <26787>
scope note: منحصر به حیوانات؛ برای گیاهان به کار برید @fa
broader: Varieties
preferred label: ارقام پرمحصول @fa
type: Concept

Varieties
preferred label: ارقام @fa
type: Concept
narrower: High yielding varieties