Products
preferred label: فراورده‌ها @fa
type: Concept
narrower: Non food products

Non food products
scope note: Of agricultural origin including non-feed products
scope note: دارای منشاء کشاورزی دربرگیرنده محصولات غیر خوراکی. @fa
broader: Products
preferred label: فراورده‌های غیر غذایی @fa
type: Concept