Resins
preferred label: رزین‌ها @fa
type: Concept
has related: Propolis

parents
label: رابطه والد فرزندی @fa

Propolis
parents: Hive products
broader: Hive products
scope note: رزینی که زنبورها با جمع کردن آن لانه‌شان را محکمتر می‌کنند. @fa
scope note: Resins collected by bees to strengthen the honeycomb
preferred label: پروپولیس @fa
type: Concept
has broader: Hive products
has related: Resins

has broader
label: دارای مفهوم (واژه) اعم @fa

Hive products
preferred label: فراورده‌های کندو @fa
type: Concept
has narrower: Propolis
narrower: Propolis

has related
label: دارای اصطلاح وابسته @fa