Processing
preferred label: فراوری @fa
type: Concept
has narrower: Coating
narrower: Coating

Coating
alternative label: Glazing (products)
alternative label: لعاب‌زنی (فراورده‌ها) @fa
scope note: برای پوشش بذر به کار برید پوشش‌دهی بذر @fa
scope note: For seed coating use <6936>
broader: Processing
preferred label: اندودسازی @fa
type: Concept