رنگ‌زدایی (پاکیزه‌سازی)
scope note: منحصر به فرایندهای فنی؛ برای تغییرات ناخواسته رنگ به کار برید بدرنگی
scope note: Restricted to technical processes; for undesired change of colour use <26771> @en
broader: خالص‌سازی
preferred label: Decolorization @en
type: Concept

خالص‌سازی
preferred label: Purification @en
type: Concept
has narrower: رنگ‌زدایی (پاکیزه‌سازی)
narrower: رنگ‌زدایی (پاکیزه‌سازی)