USSR
preferred label: اتحاد جماهیر سوسیالیست شوروی (یو.اس.اس.آر) @fa
type: Concept
has narrower: Armenian SSR
narrower: Armenian SSR

Armenian SSR
scope note: قسمتی از اتحاد جماهیر شوروی تا سال 1991;به منظور استفاده از مدارک مربوط به آن منطقه قبل از تغییر وضعیت; برای بعد از آن به کار برید ارمنستان @fa
scope note: Part of USSR till 1991; to be used for documents dealing with that region before the change of status; later use <8926>
broader: USSR
preferred label: ارمنستان (جمهوری سوسیالیست شوروی) @fa
type: Concept