USSR
preferred label: اتحاد جماهیر سوسیالیست شوروی (یو.اس.اس.آر) @fa
type: Concept
has narrower: RSFSR
narrower: RSFSR

RSFSR
alternative label: Russian Soviet Fed Soc Republic
alternative label: جمهوری سوسیالیست فدرال شوروی @fa
scope note: جمهوری فدرال سوسیالیستی روسیه شوروی؛ قسمتی از اتحاد جماهیر شوروی تا 24 دسامبر سال 1991؛ برای استفاده از مدارک مربوط به آن منطقه قل از تغییر وضعیت؛ برای بعد از آن به کار برید اتحادیه روسیه @fa
scope note: Russian Socialist Federal Soviet Republic; part of USSR till 24 December 1991; to be used for documents dealing with that region before the change of status; later use <33240>
broader: USSR
preferred label: جمهوری سوسیالیست فدرال شوروی (آر.اس.اف.اس.آر) @fa
type: Concept