USSR
preferred label: اتحاد جماهیر سوسیالیست شوروی (یو.اس.اس.آر) @fa
type: Concept
has narrower: Georgian SSR
narrower: Georgian SSR

Georgian SSR
scope note: قسمتی از اتحاد جماهیر شوروی تا سال 1991؛ برای مدارک مربوط به آن منطقه قبل از تغییر وضعیت؛ برای بعد از آن به کار برید گرجستان @fa
scope note: Part of USSR till 1991; for documents dealing with that region before the change of status; later use <33250>
broader: USSR
preferred label: گرجستان (جمهوری سوسیالیست شوری) @fa
type: Concept