لیتوانی (جمهوری سوسیالیست شوروی)
scope note: قسمتی از اتحاد جماهیر شوروی تا سال 1991؛ برای استفاده از مدارک مربوط به آن منطقه قبل از تغییر وضعیت؛ برای بعد از آن به کار برید لیتوانی
scope note: Part of USSR till 1991; to be used for documents dealing with that region before the change of status; later use <12204> @en
broader: اتحاد جماهیر سوسیالیست شوروی (یو.اس.اس.آر)
preferred label: Lithuanian SSR @en
type: Concept

اتحاد جماهیر سوسیالیست شوروی (یو.اس.اس.آر)
preferred label: USSR @en
type: Concept
has narrower: لیتوانی (جمهوری سوسیالیست شوروی)
narrower: لیتوانی (جمهوری سوسیالیست شوروی)