دارای اصطلاح اخص
label: has narrower @en

تنظیم فیزیولوژیکی
preferred label: Physiological regulation @en
type: Concept
دارای اصطلاح وابسته: هومئوستاز

هومئوستاز
دارای اصطلاح اخص: موازنه اسید- باز
دارای اصطلاح وابسته: تنظیم فیزیولوژیکی
scope note: Maintaining of a stable internal physiological balance in organisms @en
scope note: حفظ تعادل فیزیولوژیکی داخلی به صورت ثابت در موجودات زنده.
narrower: موازنه اسید- باز
preferred label: Homeostasis @en
type: Concept

دارای اصطلاح وابسته
label: has related @en

موازنه اسید- باز
preferred label: Acid base equilibrium @en
type: Concept
parents: هومئوستاز
has broader: هومئوستاز
broader: هومئوستاز