زمین
scope note: زمین به عنوان سیاره؛ برای زمین به عنوان محیط رشد به کار برید خاک
scope note: The Earth as a planet; for earth as a growing medium use <7156> @en
narrower: جو (زمین)
preferred label: Earth @en
type: Concept

جو (زمین)
preferred label: Atmosphere @en
type: Concept
parents: زمین
has broader: زمین
broader: زمین