Parasitism
preferred label: زندگی انگلی @fa
type: Concept
has narrower: Superparasitism
narrower: Superparasitism

Superparasitism
scope note: Condition resulting from several infestations of different origin or of two or more primary parasite species
scope note: شرایط ناشی از هجوم چندین گونه متفاوت یا دو یا چند گونه انگلی اولیه. @fa
broader: Parasitism
preferred label: ابرانگلی @fa
type: Concept