دارای اصطلاح اخص
label: has narrower @en

نئوپلاسم‌ها
preferred label: Neoplasms @en
type: Concept
دارای اصطلاح اخص: کیست‌ها

رابطه والد فرزندی
label: parents @en

کیست‌های تخمدانی
preferred label: Ovarian cysts @en
type: Concept
دارای مفهوم (واژه) اعم: کیست‌ها
broader: کیست‌ها

دارای مفهوم (واژه) اعم
label: has broader @en

کیست‌ها
scope note: Abnormal saclike swellings containing liquid or semisolid material or foreign bodies @en
scope note: تورم کیسه‌مانند ناهنجار محتوی مایع یا مواد نیمه‌جامد یا اجسام خارجی.
رابطه والد فرزندی: نئوپلاسم‌ها
preferred label: Cysts @en
narrower: کیست‌های تخمدانی
دارای اصطلاح اخص: کیست‌های تخمدانی
type: Concept
دارای مفهوم (واژه) اعم: نئوپلاسم‌ها