Wood technology
preferred label: فناوری چوب @fa
type: Concept
has narrower: Wood conditioning
narrower: Wood conditioning

Wood conditioning
scope note: Adjustment of the moisture content of timber to the purposes for which it is to be used
broader: Wood technology
preferred label: آماده‌سازی چوب (از نظر رطوبت و دما) @fa
type: Concept