RFLP
scope note: Restriction fragment length polymorphism
scope note: محدودیت اجزای طولانی چندریختی. @fa
broader: Biochemical polymorphism
preferred label: آر.اف.ال.پی @fa
type: Concept

Biochemical polymorphism
preferred label: چندریختی زیست‌شیمیایی @fa
type: Concept
narrower: RFLP