دارای مفهوم (واژه) اعم
label: has broader @en

کوتیکل گیاهی
رابطه والد فرزندی: روپوست (بافت گیاهی)
دارای مفهوم (واژه) اعم: روپوست (بافت گیاهی)
scope note: Thin layer of cutin or waxy material on the external surface of plants @en
scope note: لایه نازک کوتین یا ماده مومی روی سطح خارجی گیاهان
broader: روپوست (بافت گیاهی)
preferred label: Plant cuticle @en
type: Concept

رابطه والد فرزندی
label: parents @en

روپوست (بافت گیاهی)
preferred label: Epidermis @en
type: Concept
has narrower: کوتیکل گیاهی
narrower: کوتیکل گیاهی