Virgin forests
alternative label: Primary forests
alternative label: جنگل‌های اولیه @fa
scope note: Forests virtually uninfluenced by human activity
scope note: جنگل‌هایی که در واقع تحت تاثیر فعالیت انسان قرار نگرفته‌اند. @fa
broader: Forests
preferred label: جنگل‌های بکر @fa
type: Concept

Forests
preferred label: جنگل‌ها @fa
type: Concept
narrower: Virgin forests