دارای مفهوم (واژه) اعم
label: has broader @en

رابطه والد فرزندی
label: parents @en

میکروارگانیسم‌ها
preferred label: Microorganisms @en
type: Concept
has narrower: میکروارگانیسم‌های میان‌خواه
narrower: میکروارگانیسم‌های میان‌خواه

میکروارگانیسم‌های میان‌خواه
رابطه والد فرزندی: میکروارگانیسم‌ها
دارای مفهوم (واژه) اعم: میکروارگانیسم‌ها
scope note: Microorganisms with optimum temperature for growth between 20 and 45 degrees C @en
scope note: میکروارگانیسم‌ها با دمای مطلوب برای رشد بین 20 و 45 درجه سانتیگراد.
broader: میکروارگانیسم‌ها
preferred label: Mesophile microorganisms @en
type: Concept