Root harvesters
preferred label: دروگرهای گیاهان ریشه‌ای @fa
type: Concept
narrower: Root cutters

Root cutters
scope note: Appliances used to cut roots and tubers used as animal feeds
scope note: ابزار مورد استفاده برای قطع ریشه‌ها و تکمه‌های دارای کاربرد برای تغذیه جانوری. @fa
broader: Root harvesters
preferred label: برش‌دهنده‌های محصولات ریشه‌ای @fa
type: Concept